Target
Glycogen phosphorylase, muscle form
Ligand
BDBM50312225
Substrate
Meas. Tech.
ChEMBL_1733215 (CHEMBL4148751)
Ki
780±n/a nM
Citation
 Kun, SBegum, JKyriakis, EStamati, ECVBarkas, TASzennyes, EBokor, ÉSzabó, KEStravodimos, GASipos, ÁDocsa, TGergely, PMoffatt, CPatraskaki, MSKokolaki, MCGkerdi, ASkamnaki, VTLeonidas, DDSomsák, LHayes, JM A multidisciplinary study of 3-(?-d-glucopyranosyl)-5-substituted-1,2,4-triazole derivatives as glycogen phosphorylase inhibitors: Computation, synthesis, crystallography and kinetics reveal new potent inhibitors. Eur J Med Chem 147:266-278 (2018)  
Target
Name:
Glycogen phosphorylase, muscle form
Synonyms:
Glycogen Phosphorylase (PYGM) Glycogen phosphorylase, muscle form PYGM | PYGM_RABIT
Type:
Enzyme
Mol. Mass.:
97296.32
Organism:
Oryctolagus cuniculus (rabbit)
Description:
Phosphorylation of Ser-15 converts phosphorylase B (unphosphorylated) to phosphorylase A.
Residue:
843
  
Inhibitor
Name:
BDBM50312225
Synonyms:
CHEMBL4161353
Type:
Small organic molecule
Emp. Form.:
C19H19N3O7
Mol. Mass.:
401.3701
SMILES:
OC[C@H]1O[C@H]([C@H](O)[C@@H](O)[C@@H]1O)c1nc(n[nH]1)-c1ccc2cc(ccc2c1)C(O)=O
: