Target
Acetylcholine receptor subunit alpha
Ligand
BDBM50310000
Substrate
Meas. Tech.
ChEMBL_1734272 (CHEMBL4149808)
IC50
11300±n/a nM
Citation
 Tahirovic, YATruax, VMWilson, RJJecs, ENguyen, HHMiller, EJKim, MBKuo, KMWang, TSum, CSCvijic, MESchroeder, GMWilson, LJLiotta, DC Discovery of  ACS Med Chem Lett 9:446-451 (2018)  
Target
Name:
Acetylcholine receptor subunit alpha
Synonyms:
ACHA_HUMAN Acetylcholine receptor protein alpha chain CHNRA Cholinergic, Nicotinic Alpha1Beta1DeltaGamma Nicotinic acetylcholine receptor alpha-1/beta-1 Nicotinic acetylcholine receptor alpha2/beta4 n-AChR
Type:
Ion channel
Mol. Mass.:
54542.01
Organism:
Homo sapiens (Human)
Description:
Residue:
482
  
Inhibitor
Name:
BDBM50310000
Synonyms:
4-((1H-1,2,4-Triazol-1-yl)methyl)-5-(4-bromophenyl)-N-(1-(4-bromophenyl)ethyl)-1-(2-chlorophenyl)-1H-pyrazole-3-carboxamide | CHEMBL598769
Type:
Small organic molecule
Emp. Form.:
C27H21Br2ClN6O
Mol. Mass.:
640.756
SMILES:
Cc1cc(Br)ccc1CNC(=O)c1nn(c(c1Cn1cncn1)-c1ccc(Br)cc1)-c1ccccc1Cl
: