Target
Serine/threonine-protein kinase Nek1
Ligand
BDBM50353060
Substrate
Meas. Tech.
ChEMBL_1734995 (CHEMBL4150531)
IC50
>10000±n/a nM
Citation
 Hatcher, JMWang, ESJohannessen, LKwiatkowski, NSim, TGray, NS Development of Highly Potent and Selective Steroidal Inhibitors and Degraders of CDK8. ACS Med Chem Lett 9:540-545 (2018)  
Target
Name:
Serine/threonine-protein kinase Nek1
Synonyms:
KIAA1901 NEK1 Never in mitosis A-related kinase 1 Renal carcinoma antigen NY-REN-55
Type:
Protein
Mol. Mass.:
142810.07
Organism:
Homo sapiens (Human)
Description:
Residue:
1258
  
Inhibitor
Name:
BDBM50353060
Synonyms:
CHEMBL4167193
Type:
Small organic molecule
Emp. Form.:
C30H40N2
Mol. Mass.:
428.652
SMILES:
[H][C@@]12CC[C@H](c3ccc4ccncc4c3)[C@@]1(C)CC[C@@]1([H])[C@@]2([H])CC=C2C[C@H](CC[C@]12C)N(C)C
: