Target
Bromodomain-containing protein 4
Ligand
BDBM50103503
Substrate
Meas. Tech.
ChEMBL_1737366 (CHEMBL4153116)
IC50
3850±n/a nM
Citation
 Liu, ZTian, BChen, HWang, PBrasier, ARZhou, J Discovery of potent and selective BRD4 inhibitors capable of blocking TLR3-induced acute airway inflammation. Eur J Med Chem 151:450-461 (2018)  
Target
Name:
Bromodomain-containing protein 4
Synonyms:
BRD4 Bromodomain-containing protein 4 (BRD4) Protein HUNK1
Type:
Protein
Mol. Mass.:
152264.84
Organism:
Homo sapiens (Human)
Description:
O60885
Residue:
1362
  
Inhibitor
Name:
BDBM50103503
Synonyms:
CHEMBL2393130 | US11117865, Compound RVX-208
Type:
Small organic molecule
Emp. Form.:
C20H22N2O5
Mol. Mass.:
370.3991
SMILES:
COc1cc(OC)c2c(c1)nc([nH]c2=O)-c1cc(C)c(OCCO)c(C)c1
: