Target
P2X purinoceptor 1
Ligand
BDBM50179360
Substrate
Meas. Tech.
ChEMBL_1737463 (CHEMBL4153213)
IC50
4300±n/a nM
Citation
 Kwak, SHShin, SLee, JHShim, JKKim, MLee, SDLee, ABae, JPark, JHAbdelrahman, AMüller, CECho, SKKang, SGBae, MAYang, JYKo, HGoddard, WAKim, YC Synthesis and structure-activity relationships of quinolinone and quinoline-based P2X7 receptor antagonists and their anti-sphere formation activities in glioblastoma cells. Eur J Med Chem 151:462-481 (2018)  
Target
Name:
P2X purinoceptor 1
Synonyms:
ATP receptor P2RX1_HUMAN Purinergic receptor | Purinergic, P2X
Type:
Enzyme Catalytic Domain
Mol. Mass.:
44992.65
Organism:
Homo sapiens (Human)
Description:
Purinergic, P2X 0 HUMAN::P51575
Residue:
399
  
Inhibitor
Name:
BDBM50179360
Synonyms:
CHEMBL3040216
Type:
Small organic molecule
Emp. Form.:
C51H40N6O23S6
Mol. Mass.:
1297.28
SMILES:
CC1=CCC(=C\C1=N\C(=O)C1=CC=C\C(C1)=N/C(=O)/N=C1/CC(=CC=C1)C(=O)\N=C1\CC(=CC=C1C)C(=O)\N=C1/CC=C(c2cc(cc(c12)S(O)(=O)=O)S(O)(=O)=O)S(O)(=O)=O)C(=O)\N=C1/CC=C(c2cc(cc(c12)S(O)(=O)=O)S(O)(=O)=O)S(O)(=O)=O
: