Target
Transient receptor potential cation channel subfamily M member 2
Ligand
BDBM18137
Substrate
Meas. Tech.
ChEMBL_1738672 (CHEMBL4154422)
IC50
70000±n/a nM
Citation
 Zhang, HLiu, HLuo, XWang, YLiu, YJin, HLiu, ZYang, WYu, PZhang, LZhang, L Design, synthesis and biological activities of 2,3-dihydroquinazolin-4(1H)-one derivatives as TRPM2 inhibitors. Eur J Med Chem 152:235-252 (2018)  
Target
Name:
Transient receptor potential cation channel subfamily M member 2
Synonyms:
EREG1 KNP3 LTrpC-2 TRPC7 TRPM2_HUMAN | Transient receptor potential channel 7
Type:
PROTEIN
Mol. Mass.:
171218.39
Organism:
Homo sapiens (Human)
Description:
ChEMBL_103516
Residue:
1503
  
Inhibitor
Name:
BDBM18137
Synonyms:
AMP US11185100, TABLE 7.3 adenosine 5 -monophosphate | {[(2R,3S,4R,5R)-5-(6-amino-9H-purin-9-yl)-3,4-dihydroxyoxolan-2-yl]methoxy}phosphonic acid
Type:
Nucleoside or nucleotide
Emp. Form.:
C10H14N5O7P
Mol. Mass.:
347.2212
SMILES:
Nc1ncnc2n(cnc12)[C@@H]1O[C@H](COP(O)(O)=O)[C@@H](O)[C@H]1O
: