Target
N-arachidonyl glycine receptor
Ligand
BDBM50056486
Substrate
Meas. Tech.
ChEMBL_1740206 (CHEMBL4155956)
EC50
20±n/a nM
Citation
 Schoeder, CTKaleta, MMahardhika, ABOlejarz-Maciej, A?a?ewska, DKie?-Kononowicz, KMüller, CE Structure-activity relationships of imidazothiazinones and analogs as antagonists of the cannabinoid-activated orphan G protein-coupled receptor GPR18. Eur J Med Chem 155:381-397 (2018)  
Target
Name:
N-arachidonyl glycine receptor
Synonyms:
G-protein coupled receptor 18 GPR18 NAGly receptor
Type:
PROTEIN
Mol. Mass.:
38150.44
Organism:
Homo sapiens (Human)
Description:
ChEMBL_107601
Residue:
331
  
Inhibitor
Name:
BDBM50056486
Synonyms:
((5Z,8Z)-Icosa-5,8,11,14-tetraenoylamino)-acetic acid Arachidonoyl glycine | CHEMBL161343
Type:
Small organic molecule
Emp. Form.:
C22H35NO3
Mol. Mass.:
361.5182
SMILES:
CCCCC\C=C/C\C=C/C\C=C/C\C=C/CCCC(=O)NCC(O)=O
: