Target
Adenosine receptor A1
Ligand
BDBM50449635
Substrate
Meas. Tech.
ChEMBL_1740321 (CHEMBL4156071)
Ki
47±n/a nM
Citation
 Varano, FCatarzi, DVincenzi, FFalsini, MPasquini, SBorea, PAColotta, VVarani, K Structure-activity relationship studies and pharmacological characterization of N Eur J Med Chem 155:552-561 (2018)  
Target
Name:
Adenosine receptor A1
Synonyms:
A1 adenosine receptor (hA1) AA1R_HUMAN ADORA1 Adenosine A1-receptor Adenosine receptor A1 (hA1) | Adenosine transporter (AdT)
Type:
G Protein-Coupled Receptor (GPCR)
Mol. Mass.:
36520.92
Organism:
Homo sapiens (Human)
Description:
P30542
Residue:
326
  
Inhibitor
Name:
BDBM50449635
Synonyms:
CHEMBL4175676
Type:
Small organic molecule
Emp. Form.:
C15H12N6OS
Mol. Mass.:
324.36
SMILES:
Nc1nc(NCc2ccncc2)nc2sc(nc12)-c1ccco1
: