Target
Adenosine receptor A2a
Ligand
BDBM50449638
Substrate
Meas. Tech.
ChEMBL_1740325 (CHEMBL4156075)
IC50
3.4±n/a nM
Citation
 Varano, FCatarzi, DVincenzi, FFalsini, MPasquini, SBorea, PAColotta, VVarani, K Structure-activity relationship studies and pharmacological characterization of N Eur J Med Chem 155:552-561 (2018)  
Target
Name:
Adenosine receptor A2a
Synonyms:
A2A adenosine receptor (hA2A) ADENOSINE A2 ADORA2 Adenosine A2A receptor (A2AAR)
Type:
G Protein-Coupled Receptor (GPCR)
Mol. Mass.:
44716.46
Organism:
Homo sapiens (Human)
Description:
P29274
Residue:
412
  
Inhibitor
Name:
BDBM50449638
Synonyms:
CHEMBL4162037
Type:
Small organic molecule
Emp. Form.:
C17H15N5OS2
Mol. Mass.:
369.464
SMILES:
COc1ccccc1CNc1nc(N)c2nc(sc2n1)-c1cccs1
: