Target
Adenosine receptor A1
Ligand
BDBM50449643
Substrate
Meas. Tech.
ChEMBL_1740321 (CHEMBL4156071)
Ki
73±n/a nM
Citation
 Varano, FCatarzi, DVincenzi, FFalsini, MPasquini, SBorea, PAColotta, VVarani, K Structure-activity relationship studies and pharmacological characterization of N Eur J Med Chem 155:552-561 (2018)  
Target
Name:
Adenosine receptor A1
Synonyms:
A1 adenosine receptor (hA1) AA1R_HUMAN ADORA1 Adenosine A1-receptor Adenosine receptor A1 (hA1) | Adenosine transporter (AdT)
Type:
G Protein-Coupled Receptor (GPCR)
Mol. Mass.:
36520.92
Organism:
Homo sapiens (Human)
Description:
P30542
Residue:
326
  
Inhibitor
Name:
BDBM50449643
Synonyms:
CHEMBL4168016
Type:
Small organic molecule
Emp. Form.:
C14H11N5S3
Mol. Mass.:
345.466
SMILES:
Nc1nc(NCc2cccs2)nc2sc(nc12)-c1cccs1
: