Target
Adenosine receptor A3
Ligand
BDBM50449642
Substrate
Meas. Tech.
ChEMBL_1740323 (CHEMBL4156073)
Ki
23±n/a nM
Citation
 Varano, FCatarzi, DVincenzi, FFalsini, MPasquini, SBorea, PAColotta, VVarani, K Structure-activity relationship studies and pharmacological characterization of N Eur J Med Chem 155:552-561 (2018)  
Target
Name:
Adenosine receptor A3
Synonyms:
A3 adenosine receptor (hA3) ADORA3 | Adenosine A3 receptor (A3AR)
Type:
G Protein-Coupled Receptor (GPCR)
Mol. Mass.:
36197.32
Organism:
Homo sapiens (Human)
Description:
P0DMS8
Residue:
318
  
Inhibitor
Name:
BDBM50449642
Synonyms:
CHEMBL4167557
Type:
Small organic molecule
Emp. Form.:
C15H13N5O2S
Mol. Mass.:
327.361
SMILES:
Nc1nc(NCCc2ccco2)nc2sc(nc12)-c1ccco1
: