Target
Catechol O-methyltransferase
Ligand
BDBM50450452
Substrate
Meas. Tech.
ChEMBL_1742588 (CHEMBL4158338)
IC50
>1.000000±n/a nM
Citation
 Buchler, IAkuma, DAu, VCarr, Gde León, PDePasquale, MErnst, GHuang, YKimos, MKolobova, APoslusney, MWei, HSwinnen, DMontel, FMoureau, FJigorel, ESchulze, MEDWood, MBarrow, JC Optimization of 8-Hydroxyquinolines as Inhibitors of Catechol O-Methyltransferase. J Med Chem 61:9647-9665 (2018)  
Target
Name:
Catechol O-methyltransferase
Synonyms:
COMT_RAT Catechol-O-methyltransferase | Comt
Type:
Enzyme
Mol. Mass.:
29594.09
Organism:
Rattus norvegicus (Rat)
Description:
Residue:
264
  
Inhibitor
Name:
BDBM50450452
Synonyms:
CHEMBL4167128
Type:
Small organic molecule
Emp. Form.:
C14H14FNO3S
Mol. Mass.:
295.329
SMILES:
Oc1c(F)cc(c2cccnc12)S(=O)(=O)C1CCCC1
: