Target
Lanosterol synthase
Ligand
BDBM50108877
Substrate
Meas. Tech.
ChEMBL_1742619 (CHEMBL4158369)
IC50
>1.000000±n/a nM
Citation
 Buchler, IAkuma, DAu, VCarr, Gde León, PDePasquale, MErnst, GHuang, YKimos, MKolobova, APoslusney, MWei, HSwinnen, DMontel, FMoureau, FJigorel, ESchulze, MEDWood, MBarrow, JC Optimization of 8-Hydroxyquinolines as Inhibitors of Catechol O-Methyltransferase. J Med Chem 61:9647-9665 (2018)  
Target
Name:
Lanosterol synthase
Synonyms:
LSS_RAT Osc
Type:
PROTEIN
Mol. Mass.:
83302.12
Organism:
Rattus norvegicus
Description:
ChEMBL_12083
Residue:
733
  
Inhibitor
Name:
BDBM50108877
Synonyms:
(3,4-Dihydroxy-5-nitro-phenyl)-p-tolyl-methanone CHEMBL1324 TOLCAPONE Tasmar
Type:
Small organic molecule
Emp. Form.:
C14H11NO5
Mol. Mass.:
273.2408
SMILES:
Cc1ccc(cc1)C(=O)c1cc(O)c(O)c(c1)[N+]([O-])=O
: