Target
Heparanase
Ligand
BDBM50179360
Substrate
Meas. Tech.
ChEMBL_1744396 (CHEMBL4178906)
Ki
48000±n/a nM
Citation
 Rondanin, RFochi, SBaruchello, RBernardi, TOliva, PSemeraro, FSimoni, DGiannini, G Arylamidonaphtalene sulfonate compounds as a novel class of heparanase inhibitors. Bioorg Med Chem Lett 27:4421-4425 (2017)  
Target
Name:
Heparanase
Synonyms:
3.2.1.166 HPSE_MOUSE Heparanase 50 kDa subunit Hpa | Hpse
Type:
PROTEIN
Mol. Mass.:
60080.88
Organism:
Mus musculus
Description:
ChEMBL_118117
Residue:
535
  
Inhibitor
Name:
BDBM50179360
Synonyms:
CHEMBL3040216
Type:
Small organic molecule
Emp. Form.:
C51H40N6O23S6
Mol. Mass.:
1297.28
SMILES:
CC1=CCC(=C\C1=N\C(=O)C1=CC=C\C(C1)=N/C(=O)/N=C1/CC(=CC=C1)C(=O)\N=C1\CC(=CC=C1C)C(=O)\N=C1/CC=C(c2cc(cc(c12)S(O)(=O)=O)S(O)(=O)=O)S(O)(=O)=O)C(=O)\N=C1/CC=C(c2cc(cc(c12)S(O)(=O)=O)S(O)(=O)=O)S(O)(=O)=O
: