Target
Voltage-dependent T-type calcium channel subunit alpha-1H
Ligand
BDBM50451723
Substrate
Meas. Tech.
ChEMBL_1746103 (CHEMBL4180613)
IC50
12±n/a nM
Citation
 Bezençon, OReme?, LRichard, SRoch, CKessler, MErtel, EAMoon, RMawet, JPfeifer, TCapeleto, B Discovery and evaluation of Ca Bioorg Med Chem Lett 27:5326-5331 (2017)  
Target
Name:
Voltage-dependent T-type calcium channel subunit alpha-1H
Synonyms:
CAC1H_HUMAN Low-voltage-activated calcium channel alpha1 3.2 subunit Voltage-gated calcium channel voltage-dependent T-type calcium channel subunit alpha-1H isoform a
Type:
Enzyme Catalytic Domain
Mol. Mass.:
259187.68
Organism:
Homo sapiens (Human)
Description:
Calcium channel (Type T,L) 0 0::O95180
Residue:
2353
  
Inhibitor
Name:
BDBM50451723
Synonyms:
CHEMBL4205453
Type:
Small organic molecule
Emp. Form.:
C23H27ClN4O
Mol. Mass.:
410.94
SMILES:
Cn1c(Cl)c2CC(C)(C)CCc2c1C(=O)NCc1ccccc1Cn1cccn1
: