Target
Bifunctional dihydrofolate reductase-thymidylate synthase
Ligand
BDBM50452169
Substrate
Meas. Tech.
ChEMBL_1747167 (CHEMBL4181677)
IC50
229±n/a nM
Citation
 Chen, WHuang, ZWang, WMao, FGuan, LTang, YJiang, HLi, JHuang, JJiang, LZhu, J Discovery of new antimalarial agents: Second-generation dual inhibitors against FP-2 and PfDHFR via fragments assembely. Bioorg Med Chem 25:6467-6478 (2017)  
Target
Name:
Bifunctional dihydrofolate reductase-thymidylate synthase
Synonyms:
DHFR-TS Dihydrofolate Reductase-Thymidylate Synthase (DHFR-TS) Mutant KICB1 PfDHFR-TS double mutant (C59R+S108N)
Type:
Enzyme
Mol. Mass.:
71822.51
Organism:
Plasmodium falciparum (isolate K1 / Thailand)
Description:
The mutant clone was prepared by cassette mutagenesis using wildtype pfDHFR as a template, and expressed in E. coli.
Residue:
608
  
Inhibitor
Name:
BDBM50452169
Synonyms:
CHEMBL3819601
Type:
Small organic molecule
Emp. Form.:
C14H15Cl3N4O2
Mol. Mass.:
377.654
SMILES:
Cc1nc(N)nc(N)c1OCCCOc1cc(Cl)c(Cl)cc1Cl
: