Target
Voltage-dependent T-type calcium channel subunit alpha-1H
Ligand
BDBM50452242
Substrate
Meas. Tech.
ChEMBL_1747210 (CHEMBL4181720)
IC50
6.1±n/a nM
Citation
 Bezençon, OHeidmann, BSiegrist, RStamm, SRichard, SPozzi, DCorminboeuf, ORoch, CKessler, MErtel, EAReymond, IPfeifer, Tde Kanter, RToeroek-Schafroth, MMoccia, LGMawet, JMoon, RRey, MCapeleto, BFournier, E Discovery of a Potent, Selective T-type Calcium Channel Blocker as a Drug Candidate for the Treatment of Generalized Epilepsies. J Med Chem 60:9769-9789 (2017)  
Target
Name:
Voltage-dependent T-type calcium channel subunit alpha-1H
Synonyms:
CAC1H_HUMAN Low-voltage-activated calcium channel alpha1 3.2 subunit Voltage-gated calcium channel voltage-dependent T-type calcium channel subunit alpha-1H isoform a
Type:
Enzyme Catalytic Domain
Mol. Mass.:
259187.68
Organism:
Homo sapiens (Human)
Description:
Calcium channel (Type T,L) 0 0::O95180
Residue:
2353
  
Inhibitor
Name:
BDBM50452242
Synonyms:
CHEMBL4206509
Type:
Small organic molecule
Emp. Form.:
C22H19F4N3O
Mol. Mass.:
417.3994
SMILES:
Fc1ccc(Cn2ccc(NC(=O)Cc3ccc(cc3)C3CC(F)(F)C3)n2)cc1F
: