Target
Beta-secretase 1
Ligand
BDBM143218
Substrate
Meas. Tech.
ChEMBL_1748606 (CHEMBL4183116)
IC50
<0.540000±n/a nM
Citation
 O'Neill, BTBeck, EMButler, CRNolan, CEGonzales, CZhang, LDoran, SDLapham, KBuzon, LMDutra, JKBarreiro, GHou, XMartinez-Alsina, LARogers, BNVillalobos, AMurray, JCOgilvie, KLaChapelle, EAChang, CLanyon, LFSteppan, CMRobshaw, AHales, KBoucher, GGPandher, KHoule, CAmbroise, CWKaranian, DRiddell, DBales, KRBrodney, MA Design and Synthesis of Clinical Candidate PF-06751979: A Potent, Brain Penetrant, ?-Site Amyloid Precursor Protein Cleaving Enzyme 1 (BACE1) Inhibitor Lacking Hypopigmentation. J Med Chem 61:4476-4504 (2018)  
Target
Name:
Beta-secretase 1
Synonyms:
ASP2 Aspartyl protease 2 BACE1 Beta-secretase (BACE) Beta-secretase 1 (BACE 1) Beta-secretase 1 (BACE1) Beta-site amyloid precursor protein cleaving enzyme 1 Memapsin-2 beta-Secretase (BACE-1) | beta-Secretase (BACE1)
Type:
Protein
Mol. Mass.:
55755.10
Organism:
Homo sapiens (Human)
Description:
P56817
Residue:
501
  
Inhibitor
Name:
BDBM143218
Synonyms:
US8940748, 34 US9687494, 34
Type:
Small organic molecule
Emp. Form.:
C17H17ClFN5O3S
Mol. Mass.:
425.865
SMILES:
CN1C(=N)N[C@@](C)(CS1(=O)=O)c1cc(NC(=O)c2ccc(Cl)cn2)ccc1F
: