Target
Amine oxidase [flavin-containing] B
Ligand
BDBM50453019
Substrate
Meas. Tech.
ChEMBL_1748950 (CHEMBL4183460)
Ki
7.5±n/a nM
Citation
 Reis, JManzella, NCagide, FMialet-Perez, JUriarte, EParini, ABorges, FBinda, C Tight-Binding Inhibition of Human Monoamine Oxidase B by Chromone Analogs: A Kinetic, Crystallographic, and Biological Analysis. J Med Chem 61:4203-4212 (2018)  
Target
Name:
Amine oxidase [flavin-containing] B
Synonyms:
AOFB_HUMAN MAOB Monoamine oxidase type B (MAO B) Monoamine oxidase type B (MAOB)
Type:
Protein
Mol. Mass.:
58768.76
Organism:
Homo sapiens (Human)
Description:
P27338
Residue:
520
  
Inhibitor
Name:
BDBM50453019
Synonyms:
CHEMBL4206812
Type:
Small organic molecule
Emp. Form.:
C16H10ClNO3
Mol. Mass.:
299.708
SMILES:
Clc1cccc(NC(=O)c2coc3ccccc3c2=O)c1
: