Target
Receptor-type tyrosine-protein kinase FLT3
Ligand
BDBM50453196
Substrate
Meas. Tech.
ChEMBL_1749251 (CHEMBL4183761)
IC50
4.0±n/a nM
Citation
 Gucký, T?ezní?ková, ERado?ová Muchová, TJorda, RKlejová, ZMalínková, VBerka, KBazgier, VAjani, HLep?ík, MDivoký, VKry?tof, V Discovery of N J Med Chem 61:3855-3869 (2018)  
Target
Name:
Receptor-type tyrosine-protein kinase FLT3
Synonyms:
CD135 FL cytokine receptor FLK2 FLT3 Fetal liver kinase-2 Fms-like tyrosine kinase 3 (Flt-3) STK-1 Stem cell tyrosine kinase 1
Type:
Enzyme
Mol. Mass.:
112888.62
Organism:
Homo sapiens (Human)
Description:
P36888
Residue:
993
  
Inhibitor
Name:
BDBM50453196
Synonyms:
CHEMBL4216401
Type:
Small organic molecule
Emp. Form.:
C22H28BrN7
Mol. Mass.:
470.409
SMILES:
N[C@H]1CC[C@@H](CC1)Nc1nc(Nc2ccc(Br)cc2)c2ncn(C3CCCC3)c2n1
: