Target
Geranylgeranyl transferase type-1 subunit beta/Protein farnesyltransferase/geranylgeranyltransferase type-1 subunit alpha
Ligand
BDBM50076141
Substrate
Meas. Tech.
ChEMBL_1750773 (CHEMBL4185533)
IC50
50±n/a nM
Citation
 Buuh, ZYLyu, ZWang, RE Interrogating the Roles of Post-Translational Modifications of Non-Histone Proteins. J Med Chem 61:3239-3252 (2018)  
Target
Name:
Geranylgeranyl transferase type-1 subunit beta/Protein farnesyltransferase/geranylgeranyltransferase type-1 subunit alpha
Synonyms:
Geranylgeranyl transferase type I Geranylgeranyl transferase type I beta/Protein farnesyltransferase/geranylgeranyltransferase type I alpha subunit
Type:
Mol. Mass.:
Description:
ASSAY_ID of EBI is 70196
Components:
This complex has 2 components.
Component 1
Name:
Protein farnesyltransferase/geranylgeranyltransferase type-1 subunit alpha
Synonyms:
CAAX farnesyltransferase alpha subunit FNTA_HUMAN FTase-alpha Geranylgeranyl Transferase (GGTase-I) Chain A Protein Farnesyltransferase (PFT) Chain A Protein farnesyltransferase Protein farnesyltransferase/geranylgeranyltransferase type I alpha subunit | Ras proteins prenyltransferase alpha
Type:
Enzyme
Mol. Mass.:
44392.46
Organism:
Homo sapiens (Human)
Description:
Recombinant human FTase.
Residue:
379
  
Component 2
Name:
Geranylgeranyl transferase type-1 subunit beta
Synonyms:
2.5.1.59 Geranylgeranyl transferase type I Geranylgeranyl transferase type I subunit beta PGGT1B Protein farnesyl/geranylgeranyl transferase | Type I protein geranyl-geranyltransferase subunit beta
Type:
Mol. Mass.:
42369.84
Organism:
Homo sapiens (Human)
Description:
Residue:
377
  
Inhibitor
Name:
BDBM50076141
Synonyms:
(S)-2-[4-((R)-2-Amino-3-mercapto-propylamino)-2-naphthalen-1-yl-benzoylamino]-4-methyl-pentanoic acid CHEMBL27449
Type:
Small organic molecule
Emp. Form.:
C26H31N3O3S
Mol. Mass.:
465.608
SMILES:
CC(C)C[C@H](NC(=O)c1ccc(NC[C@@H](N)CS)cc1-c1cccc2ccccc12)C(O)=O
: