Target
Leucine-rich repeat serine/threonine-protein kinase 2
Ligand
BDBM50453821
Substrate
Meas. Tech.
ChEMBL_1750889 (CHEMBL4185649)
IC50
714±n/a nM
Citation
 Ferguson, FMDoctor, ZMChaikuad, ASim, TKim, NDKnapp, SGray, NS Characterization of a highly selective inhibitor of the Aurora kinases. Bioorg Med Chem Lett 27:4405-4408 (2017)  
Target
Name:
Leucine-rich repeat serine/threonine-protein kinase 2
Synonyms:
Dardarin LRRK2_HUMAN Leucine-rich repeat serine/threonine-protein kinase 2 PARK8
Type:
Protein
Mol. Mass.:
286113.20
Organism:
Homo sapiens (Human)
Description:
Q5S007
Residue:
2527
  
Inhibitor
Name:
BDBM50453821
Synonyms:
CHEMBL4206831
Type:
Small organic molecule
Emp. Form.:
C30H29N7O3
Mol. Mass.:
535.5964
SMILES:
CCC(=O)Nc1ccc(cc1)C(=O)Nc1ccc(Nc2ncc3N(C)C(=O)c4cc(C)ccc4N(C)c3n2)cc1
: