Target
Serine/threonine-protein kinase PLK4
Ligand
BDBM50453821
Substrate
Meas. Tech.
ChEMBL_1750888 (CHEMBL4185648)
IC50
82±n/a nM
Citation
 Ferguson, FMDoctor, ZMChaikuad, ASim, TKim, NDKnapp, SGray, NS Characterization of a highly selective inhibitor of the Aurora kinases. Bioorg Med Chem Lett 27:4405-4408 (2017)  
Target
Name:
Serine/threonine-protein kinase PLK4
Synonyms:
PLK4 Polo-Like Kinase 4 STK18 | Serine/threonine-protein kinase PLK4
Type:
PROTEIN
Mol. Mass.:
108996.91
Organism:
Homo sapiens (Human)
Description:
ChEMBL_1474078
Residue:
970
  
Inhibitor
Name:
BDBM50453821
Synonyms:
CHEMBL4206831
Type:
Small organic molecule
Emp. Form.:
C30H29N7O3
Mol. Mass.:
535.5964
SMILES:
CCC(=O)Nc1ccc(cc1)C(=O)Nc1ccc(Nc2ncc3N(C)C(=O)c4cc(C)ccc4N(C)c3n2)cc1
: