Target
Alkaline phosphatase, tissue-nonspecific isozyme
Ligand
BDBM50299534
Substrate
Meas. Tech.
ChEMBL_1751741 (CHEMBL4186501)
IC50
6.0±n/a nM
Citation
 Pinkerton, ABSergienko, EBravo, YDahl, RMa, CTSun, QJackson, MRCosford, NDPMillán, JL Discovery of 5-((5-chloro-2-methoxyphenyl)sulfonamido)nicotinamide (SBI-425), a potent and orally bioavailable tissue-nonspecific alkaline phosphatase (TNAP) inhibitor. Bioorg Med Chem Lett 28:31-34 (2018)  
Target
Name:
Alkaline phosphatase, tissue-nonspecific isozyme
Synonyms:
ALPL tissue-nonspecific alkaline phosphatase precursor
Type:
PROTEIN
Mol. Mass.:
57306.17
Organism:
Homo sapiens (Human)
Description:
ChEMBL_1448917
Residue:
524
  
Inhibitor
Name:
BDBM50299534
Synonyms:
5-Bromo-2-methoxy-N-(quinolin-3-yl)benzenesulfonamide cid_16654644
Type:
Small organic molecule
Emp. Form.:
C16H13BrN2O3S
Mol. Mass.:
393.255
SMILES:
COc1ccc(Br)cc1S(=O)(=O)Nc1cnc2ccccc2c1
: