Target
Probable maltase-glucoamylase 2
Ligand
BDBM50454316
Substrate
Meas. Tech.
ChEMBL_1752597 (CHEMBL4187357)
Ki
4200±n/a nM
Citation
 Li, ZPSong, YHUddin, ZWang, YPark, KH Inhibition of protein tyrosine phosphatase 1B (PTP1B) and ?-glucosidase by xanthones from Cratoxylum cochinchinense, and their kinetic characterization. Bioorg Med Chem 26:737-746 (2018)  
Target
Name:
Probable maltase-glucoamylase 2
Synonyms:
3.2.1.3 Glucoamylase MGAM2 Probable maltase-glucoamylase 2
Type:
PROTEIN
Mol. Mass.:
277932.17
Organism:
Homo sapiens
Description:
ChEMBL_116927
Residue:
2515
  
Inhibitor
Name:
BDBM50454316
Synonyms:
CHEMBL4211682
Type:
Small organic molecule
Emp. Form.:
C28H32O6
Mol. Mass.:
464.5501
SMILES:
[#6]\[#6](-[#6])=[#6]\[#6]-[#6]\[#6](-[#6])=[#6]\[#6]-c1c(-[#8])c(-[#6]-[#6](-[#8])-[#6](-[#6])=[#6])c(-[#8])c2c1oc1ccc(-[#8])cc1c2=O
: