Target
Probable maltase-glucoamylase 2
Ligand
BDBM50454323
Substrate
Meas. Tech.
ChEMBL_1752597 (CHEMBL4187357)
Ki
17700±n/a nM
Citation
 Li, ZPSong, YHUddin, ZWang, YPark, KH Inhibition of protein tyrosine phosphatase 1B (PTP1B) and ?-glucosidase by xanthones from Cratoxylum cochinchinense, and their kinetic characterization. Bioorg Med Chem 26:737-746 (2018)  
Target
Name:
Probable maltase-glucoamylase 2
Synonyms:
3.2.1.3 Glucoamylase MGAM2 Probable maltase-glucoamylase 2
Type:
PROTEIN
Mol. Mass.:
277932.17
Organism:
Homo sapiens
Description:
ChEMBL_116927
Residue:
2515
  
Inhibitor
Name:
BDBM50454323
Synonyms:
CHEMBL4209191
Type:
Small organic molecule
Emp. Form.:
C23H24O5
Mol. Mass.:
380.4337
SMILES:
[#6]\[#6](-[#6])=[#6]\[#6]-[#6]\[#6](-[#6])=[#6]\[#6]-[#8]-c1ccc2oc3cc(-[#8])cc(-[#8])c3c(=O)c2c1
: