Target
Alpha-1A adrenergic receptor
Ligand
BDBM50454719
Substrate
Meas. Tech.
ChEMBL_1753242 (CHEMBL4188002)
IC50
11±n/a nM
Citation
 Xu, MWang, YYang, FWu, CWang, ZYe, BJiang, XZhao, QLi, JLiu, YZhang, JTian, GHe, YShen, JJiang, H Synthesis and biological evaluation of a series of novel pyridinecarboxamides as potential multi-receptor antipsychotic drugs. Bioorg Med Chem Lett 28:606-611 (2018)  
Target
Name:
Alpha-1A adrenergic receptor
Synonyms:
ADA1A_HUMAN ADRA1C Alpha 1A-adrenoceptor Alpha adrenergic receptor 1a Alpha-adrenergic receptor 1c adrenergic Alpha1 | adrenergic Alpha1C
Type:
Cell-surface receptors
Mol. Mass.:
51511.67
Organism:
Homo sapiens (Human)
Description:
P35348
Residue:
466
  
Inhibitor
Name:
BDBM50454719
Synonyms:
CHEMBL4210030
Type:
Small organic molecule
Emp. Form.:
C23H27FN4O3
Mol. Mass.:
426.4839
SMILES:
CNC(=O)c1cc(OCCCCN2CCC(CC2)c2noc3cc(F)ccc23)ccn1
: