Target
Lipopolysaccharide heptosyltransferase 1
Ligand
BDBM20876
Substrate
Meas. Tech.
ChEMBL_1753351 (CHEMBL4188111)
Ki
370000±n/a nM
Citation
 Nkosana, NKCzyzyk, DJSiegel, ZSCote, JMTaylor, EA Synthesis, kinetics and inhibition of Escherichia coli Heptosyltransferase I by monosaccharide analogues of Lipid A. Bioorg Med Chem Lett 28:594-600 (2018)  
Target
Name:
Lipopolysaccharide heptosyltransferase 1
Synonyms:
2.-.-.- RFAC_ECOLI rfaC yibC
Type:
PROTEIN
Mol. Mass.:
35553.92
Organism:
Escherichia coli (strain K12)
Description:
ChEMBL_117821
Residue:
319
  
Inhibitor
Name:
BDBM20876
Synonyms:
(2R,3S,4S,5R,6S)-2-(hydroxymethyl)-6-methoxyoxane-3,4,5-triol alpha-methyl-D-glucopyranoside (AMG)
Type:
Carbonhydrate
Emp. Form.:
C7H14O6
Mol. Mass.:
194.1825
SMILES:
CO[C@H]1O[C@H](CO)[C@@H](O)[C@H](O)[C@H]1O
: