Target
Adenosine receptor A2b
Ligand
BDBM21173
Substrate
Meas. Tech.
ChEMBL_1754725 (CHEMBL4189485)
IC50
3.8±n/a nM
Citation
 Köse, MGollos, SKarcz, TFiene, AHeisig, FBehrenswerth, AKie?-Kononowicz, KNamasivayam, VMüller, CE Fluorescent-Labeled Selective Adenosine A J Med Chem 61:4301-4316 (2018)  
Target
Name:
Adenosine receptor A2b
Synonyms:
AA2BR_HUMAN ADORA2B Adenosine receptors A2b | Adenosine receptors; A2a & A2b
Type:
G Protein-Coupled Receptor (GPCR)
Mol. Mass.:
36341.22
Organism:
Homo sapiens (Human)
Description:
Residue:
332
  
Inhibitor
Name:
BDBM21173
Synonyms:
1,3-dipropyl-8-cyclopentylxanthine CHEMBL183 PD116948 | [3H]DPCPX
Type:
radiolabeled ligand
Emp. Form.:
C16H24N4O2
Mol. Mass.:
304.3874
SMILES:
CCCn1c2nc([nH]c2c(=O)n(CCC)c1=O)C1CCCC1
: