Target
Glucocorticoid receptor
Ligand
BDBM50354851
Substrate
Meas. Tech.
ChEMBL_1755053 (CHEMBL4189813)
Ki
0.510000±n/a nM
Citation
 Ghidini, EMarchini, GCapelli, AMCarnini, CCenacchi, VFioni, AFacchinetti, FRancati, F Novel Pyrrolidine Derivatives of Budesonide as Long Acting Inhaled Corticosteroids for the Treatment of Pulmonary Inflammatory Diseases. J Med Chem 61:4757-4773 (2018)  
Target
Name:
Glucocorticoid receptor
Synonyms:
GCR_HUMAN GRL Glucocorticoid receptor (GRFP) Nuclear receptor subfamily 3 group C member 1
Type:
Enzyme
Mol. Mass.:
85656.87
Organism:
Homo sapiens (Human)
Description:
P04150
Residue:
777
  
Inhibitor
Name:
BDBM50354851
Synonyms:
FLUTICASONE FUROATE | Veramyst
Type:
Small organic molecule
Emp. Form.:
C27H29F3O6S
Mol. Mass.:
538.576
SMILES:
C[C@@H]1C[C@H]2[C@@H]3C[C@H](F)C4=CC(=O)C=C[C@]4(C)[C@@]3(F)[C@@H](O)C[C@]2(C)[C@@]1(OC(=O)c1ccco1)C(=O)SCF
: