Target
Aldehyde dehydrogenase 1A1
Ligand
BDBM50456233
Substrate
Meas. Tech.
ChEMBL_1755231 (CHEMBL4189991)
IC50
6.0±n/a nM
Citation
 Yang, SMMartinez, NJYasgar, ADanchik, CJohansson, CWang, YBaljinnyam, BWang, AQXu, XShah, PCheff, DWang, XSRoth, JLal-Nag, MDunford, JEOppermann, UVasiliou, VSimeonov, AJadhav, AMaloney, DJ Discovery of Orally Bioavailable, Quinoline-Based Aldehyde Dehydrogenase 1A1 (ALDH1A1) Inhibitors with Potent Cellular Activity. J Med Chem 61:4883-4903 (2018)  
Target
Name:
Aldehyde dehydrogenase 1A1
Synonyms:
AL1A1_HUMAN ALDH-E1 ALDH1A1 Aldehyde dehydrogenase 1A1 (ALDH1A1) Aldehyde dehydrogenase family 1 member A1 (ALDH1A1) PUMB1 RalDH1 | Retinal dehydrogenase 1
Type:
Protein
Mol. Mass.:
54862.21
Organism:
Homo sapiens (Human)
Description:
Residue:
501
  
Inhibitor
Name:
BDBM50456233
Synonyms:
CHEMBL4211904
Type:
Small organic molecule
Emp. Form.:
C28H25FN4O2
Mol. Mass.:
468.5221
SMILES:
Fc1ccc2ncc(C(=O)N3CCN(CC3)C(=O)C3CC3)c(-c3ccc(cc3)C3(CC3)C#N)c2c1
: