Target
Aldehyde dehydrogenase 1A1
Ligand
BDBM50456248
Substrate
Meas. Tech.
ChEMBL_1755237 (CHEMBL4189997)
EC50
>5000±n/a nM
Citation
 Yang, SMMartinez, NJYasgar, ADanchik, CJohansson, CWang, YBaljinnyam, BWang, AQXu, XShah, PCheff, DWang, XSRoth, JLal-Nag, MDunford, JEOppermann, UVasiliou, VSimeonov, AJadhav, AMaloney, DJ Discovery of Orally Bioavailable, Quinoline-Based Aldehyde Dehydrogenase 1A1 (ALDH1A1) Inhibitors with Potent Cellular Activity. J Med Chem 61:4883-4903 (2018)  
Target
Name:
Aldehyde dehydrogenase 1A1
Synonyms:
AL1A1_HUMAN ALDH-E1 ALDH1A1 Aldehyde dehydrogenase 1A1 (ALDH1A1) Aldehyde dehydrogenase family 1 member A1 (ALDH1A1) PUMB1 RalDH1 | Retinal dehydrogenase 1
Type:
Protein
Mol. Mass.:
54862.21
Organism:
Homo sapiens (Human)
Description:
Residue:
501
  
Inhibitor
Name:
BDBM50456248
Synonyms:
CHEMBL4212457
Type:
Small organic molecule
Emp. Form.:
C25H28N4O2S
Mol. Mass.:
448.58
SMILES:
CCC(C)C1N=C2N(C1=O)C(SC(CC)C(=O)Nc1ccccc1C)=Nc1ccccc21
: