Target
Aldehyde dehydrogenase 1A1
Ligand
BDBM22794
Substrate
Meas. Tech.
ChEMBL_1755231 (CHEMBL4189991)
IC50
10.0±n/a nM
Citation
 Yang, SMMartinez, NJYasgar, ADanchik, CJohansson, CWang, YBaljinnyam, BWang, AQXu, XShah, PCheff, DWang, XSRoth, JLal-Nag, MDunford, JEOppermann, UVasiliou, VSimeonov, AJadhav, AMaloney, DJ Discovery of Orally Bioavailable, Quinoline-Based Aldehyde Dehydrogenase 1A1 (ALDH1A1) Inhibitors with Potent Cellular Activity. J Med Chem 61:4883-4903 (2018)  
Target
Name:
Aldehyde dehydrogenase 1A1
Synonyms:
AL1A1_HUMAN ALDH-E1 ALDH1A1 Aldehyde dehydrogenase 1A1 (ALDH1A1) Aldehyde dehydrogenase family 1 member A1 (ALDH1A1) PUMB1 RalDH1 | Retinal dehydrogenase 1
Type:
Protein
Mol. Mass.:
54862.21
Organism:
Homo sapiens (Human)
Description:
Residue:
501
  
Inhibitor
Name:
BDBM22794
Synonyms:
1-benzyl-2,3-dihydro-1H-indole-2,3-dione | Isatin-based compound, 14
Type:
Small organic molecule
Emp. Form.:
C15H11NO2
Mol. Mass.:
237.2533
SMILES:
O=C1N(Cc2ccccc2)c2ccccc2C1=O
: