Target
Alpha-galactosidase
Ligand
BDBM50456586
Substrate
Meas. Tech.
ChEMBL_1757450 (CHEMBL4192458)
IC50
17000±n/a nM
Citation
 Martínez-Bailén, MCarmona, ATMoreno-Clavijo, ERobina, IIde, DKato, AMoreno-Vargas, AJ Tuning of ?-glucosidase and ?-galactosidase inhibition by generation and in situ screening of a library of pyrrolidine-triazole hybrid molecules. Eur J Med Chem 138:532-542 (2017)  
Target
Name:
Alpha-galactosidase
Synonyms:
α-galactosidase Alpha-galactosidase
Type:
Protein
Mol. Mass.:
41306.82
Organism:
Coffea arabica (Coffee beans)
Description:
Residue:
378
  
Inhibitor
Name:
BDBM50456586
Synonyms:
CHEMBL4205735
Type:
Small organic molecule
Emp. Form.:
C18H20N4O3
Mol. Mass.:
340.3764
SMILES:
COc1ccc2cc(ccc2c1)-c1cn(C[C@H]2NC[C@@H](O)[C@H]2O)nn1
: