Target
Acid ceramidase
Ligand
BDBM50456926
Substrate
Meas. Tech.
ChEMBL_1758531 (CHEMBL4193539)
IC50
92±n/a nM
Citation
 Li, YChen, QYang, LLi, YZhang, YQiu, YRen, JLu, C Identification of highly potent N-acylethanolamine acid amidase (NAAA) inhibitors: Optimization of the terminal phenyl moiety of oxazolidone derivatives. Eur J Med Chem 139:214-221 (2017)  
Target
Name:
Acid ceramidase
Synonyms:
AC ASAH1_RAT Acid ceramidase Acylsphingosine deacylase N-acylsphingosine amidohydrolase
Type:
Enzyme
Mol. Mass.:
44450.22
Organism:
Rattus norvegicus (Rat)
Description:
Q6P7S1
Residue:
394
  
Inhibitor
Name:
BDBM50456926
Synonyms:
CHEMBL4213415
Type:
Small organic molecule
Emp. Form.:
C16H19NO4
Mol. Mass.:
289.3264
SMILES:
O=C(N1CCOC1=O)c1ccc(OC2CCCCC2)cc1
: