Target
Aminopeptidase N
Ligand
BDBM50457475
Substrate
Meas. Tech.
ChEMBL_1759816 (CHEMBL4194824)
Ki
1.5±n/a nM
Citation
 Amin, SAAdhikari, NJha, T Design of Aminopeptidase N Inhibitors as Anti-cancer Agents. J Med Chem 61:6468-6490 (2018)  
Target
Name:
Aminopeptidase N
Synonyms:
AMPN_PIG AP-M Alanyl aminopeptidase Aminopeptidase N (APN) Microsomal aminopeptidase pAPN
Type:
Protein
Mol. Mass.:
108810.25
Organism:
Sus scrofa (Pig)
Description:
P15145
Residue:
963
  
Inhibitor
Name:
BDBM50457475
Synonyms:
CHEMBL4216408
Type:
Small organic molecule
Emp. Form.:
C28H33N2O5P
Mol. Mass.:
508.5458
SMILES:
C[C@@](Cc1ccccc1)(NC(=O)[C@H](Cc1ccccc1)CP(O)(=O)C(N)Cc1ccccc1)C(O)=O
: