Target
Bromodomain-containing protein 2
Ligand
BDBM50457496
Substrate
Meas. Tech.
ChEMBL_1759896 (CHEMBL4194904)
Ki
2.5±n/a nM
Citation
 Fidanze, SDLiu, DMantei, RAHasvold, LAPratt, JKSheppard, GSWang, LHolms, JHDai, YAguirre, ABogdan, ADietrich, JDMarjanovic, JPark, CHHutchins, CWLin, XBui, MHHuang, XWilcox, DLi, LWang, RKovar, PMagoc, TJRajaraman, GAlbert, DHShen, YKati, WMMcDaniel, KF Discovery and optimization of novel constrained pyrrolopyridone BET family inhibitors. Bioorg Med Chem Lett 28:1804-1810 (2018)  
Target
Name:
Bromodomain-containing protein 2
Synonyms:
BRD2 Bromodomain and extra-terminal motif (BET) Bromodomain-containing protein 2 (BRD2) RING3
Type:
Protein
Mol. Mass.:
88085.95
Organism:
Homo sapiens (Human)
Description:
P25440
Residue:
801
  
Inhibitor
Name:
BDBM50457496
Synonyms:
CHEMBL4217457
Type:
Small organic molecule
Emp. Form.:
C23H19F2N3O3S
Mol. Mass.:
455.477
SMILES:
Cn1cc2-c3cc(CS(C)(=O)=O)ccc3N(Cc3c[nH]c(c23)c1=O)c1ccc(F)cc1F
: