Target
Retinoic acid receptor alpha
Ligand
BDBM50457547
Substrate
Meas. Tech.
ChEMBL_1760056 (CHEMBL4195064)
EC50
103±n/a nM
Citation
 Thoreau, EArlabosse, JMBouix-Peter, CChambon, SChantalat, LDaver, SDumais, LDuvert, GFeret, AOuvry, GPascau, JRaffin, CRodeville, NSoulet, CTabet, STalano, SPortal, T Structure-based design of Trifarotene (CD5789), a potent and selective RAR? agonist for the treatment of acne. Bioorg Med Chem Lett 28:1736-1741 (2018)  
Target
Name:
Retinoic acid receptor alpha
Synonyms:
NR1B1 RAR-alpha RARA_HUMAN Retinoic acid receptor alpha/Retinoid X receptor alpha Retinoid receptor
Type:
PROTEIN
Mol. Mass.:
50778.87
Organism:
Homo sapiens (Human)
Description:
ChEMBL_1466191
Residue:
462
  
Inhibitor
Name:
BDBM50457547
Synonyms:
CHEMBL3953756
Type:
Small organic molecule
Emp. Form.:
C31H37NO4
Mol. Mass.:
487.6298
SMILES:
CC(C)(C)c1cc(ccc1N1CCCC1)-c1cc(ccc1OCCCCO)-c1ccc(cc1)C(O)=O
: