Target
Retinoic acid receptor beta
Ligand
BDBM50457549
Substrate
Meas. Tech.
ChEMBL_1760058 (CHEMBL4195066)
EC50
17±n/a nM
Citation
 Thoreau, EArlabosse, JMBouix-Peter, CChambon, SChantalat, LDaver, SDumais, LDuvert, GFeret, AOuvry, GPascau, JRaffin, CRodeville, NSoulet, CTabet, STalano, SPortal, T Structure-based design of Trifarotene (CD5789), a potent and selective RAR? agonist for the treatment of acne. Bioorg Med Chem Lett 28:1736-1741 (2018)  
Target
Name:
Retinoic acid receptor beta
Synonyms:
HAP NR1B2 RAR-beta RARB Retinoic acid receptor RXR-alpha/Retinoic acid receptor beta Retinoid receptor
Type:
PROTEIN
Mol. Mass.:
50498.70
Organism:
Homo sapiens (Human)
Description:
ChEMBL_1458015
Residue:
455
  
Inhibitor
Name:
BDBM50457549
Synonyms:
CHEMBL3960035
Type:
Small organic molecule
Emp. Form.:
C31H39NO4
Mol. Mass.:
489.6457
SMILES:
CCN(CC)c1ccc(cc1C(C)(C)C)-c1cc(ccc1OCCCCO)-c1ccc(cc1)C(O)=O
: