Target
Retinoic acid receptor gamma
Ligand
BDBM50457568
Substrate
Meas. Tech.
ChEMBL_1760055 (CHEMBL4195063)
EC50
168±n/a nM
Citation
 Thoreau, EArlabosse, JMBouix-Peter, CChambon, SChantalat, LDaver, SDumais, LDuvert, GFeret, AOuvry, GPascau, JRaffin, CRodeville, NSoulet, CTabet, STalano, SPortal, T Structure-based design of Trifarotene (CD5789), a potent and selective RAR? agonist for the treatment of acne. Bioorg Med Chem Lett 28:1736-1741 (2018)  
Target
Name:
Retinoic acid receptor gamma
Synonyms:
NR1B3 RAR-gamma RARG_HUMAN Retinoic acid receptor gamma | Retinoid receptor
Type:
PROTEIN
Mol. Mass.:
50345.43
Organism:
Homo sapiens (Human)
Description:
ChEMBL_1458016
Residue:
454
  
Inhibitor
Name:
BDBM50457568
Synonyms:
CHEMBL4211195
Type:
Small organic molecule
Emp. Form.:
C32H38O6
Mol. Mass.:
518.6405
SMILES:
COCCOCOc1ccc(cc1-c1ccc2c(c1)C(C)(C)CCC2(C)C)-c1ccc(C(O)=O)c(OC)c1
: