Target
Sodium- and chloride-dependent glycine transporter 1
Ligand
BDBM50457706
Substrate
Meas. Tech.
ChEMBL_1760513 (CHEMBL4195521)
IC50
10.0±n/a nM
Citation
 Santora, VJAlmos, TABarido, RBasinger, JBellows, CLBookser, BCBreitenbucher, JGBroadbent, NJCabebe, CChai, CKChen, MChow, SChung, MCrickard, LDanks, AMFreestone, GCGitnick, DGupta, VHoffmaster, CHudson, ARKaplan, APKennedy, MRLee, DLimberis, JLy, KMak, CCMasatsugu, BMorse, ACNa, JNeul, DNikpur, JPeters, MPetroski, RERenick, JSebring, KSevidal, STabatabaei, AWen, JYan, YYoder, ZWZook, D Design and Synthesis of Novel and Selective Glycine Transporter-1 (GlyT1) Inhibitors with Memory Enhancing Properties. J Med Chem 61:6018-6033 (2018)  
Target
Name:
Sodium- and chloride-dependent glycine transporter 1
Synonyms:
GlyT-1 Glycine Transporters (GlyT1c) SC6A9_HUMAN Sodium- and chloride-dependent glycine transporter 1 Sodium- and chloride-dependent glycine transporter 1 (GlyT1c) Solute carrier family 6 member 9
Type:
Enzyme
Mol. Mass.:
78270.54
Organism:
Homo sapiens (Human)
Description:
P48067
Residue:
706
  
Inhibitor
Name:
BDBM50457706
Synonyms:
CHEMBL4216391
Type:
Small organic molecule
Emp. Form.:
C23H24FN3O4S
Mol. Mass.:
457.518
SMILES:
CC(C)(C)Oc1ccc(cc1C(=O)N1Cc2cn(nc2C1)-c1ccccc1F)S(C)(=O)=O
: