Target
Coagulation factor X
Ligand
BDBM12751
Substrate
Meas. Tech.
ChEMBL_1761074 (CHEMBL4196321)
Ki
0.013000±n/a nM
Citation
 Xie, ZTian, YLv, XXiao, XZhan, MCheng, KLi, SLiao, C The selectivity and bioavailability improvement of novel oral anticoagulants: An overview. Eur J Med Chem 146:299-317 (2018)  
Target
Name:
Coagulation factor X
Synonyms:
Activated coagulation factor X (FXa) Coagulation factor X precursor F10 Factor X heavy chain Factor Xa Stuart-Prower factor
Type:
Enzyme
Mol. Mass.:
54726.60
Organism:
Homo sapiens (Human)
Description:
Residue:
488
  
Inhibitor
Name:
BDBM12751
Synonyms:
1-(3-carbamimidoylphenyl)-3-methyl-N-[4-(2-sulfamoylphenyl)phenyl]-1H-pyrazole-5-carboxamide CHEMBL37251 | SN-429
Type:
Small organic molecule
Emp. Form.:
C24H22N6O3S
Mol. Mass.:
474.535
SMILES:
Cc1cc(C(=O)Nc2ccc(cc2)-c2ccccc2S(N)(=O)=O)n(n1)-c1cccc(c1)C(N)=N
: