Target
Alanine racemase, biosynthetic
Ligand
BDBM50022057
Substrate
Meas. Tech.
ChEBML_30522
Ki
2200000±n/a nM
Citation
 Vo-Quang, YCarniato, DVo-Quang, LLacoste, AMNeuzil, ELe Goffic, F (beta-Chloro-alpha-aminoethyl)phosphonic acids as inhibitors of alanine racemase and D-alanine:D-alanine ligase. J Med Chem 29:148-51 (1986)  
Target
Name:
Alanine racemase, biosynthetic
Synonyms:
ALR1_ECOLI alr
Type:
PROTEIN
Mol. Mass.:
39155.52
Organism:
Escherichia coli (strain K12)
Description:
ChEMBL_30522
Residue:
359
  
Inhibitor
Name:
BDBM50022057
Synonyms:
(1-Amino-2-chloro-ethyl)-phosphonic acid | CHEMBL37330
Type:
Small organic molecule
Emp. Form.:
C2H7ClNO3P
Mol. Mass.:
159.509
SMILES:
NC(CCl)P(O)(O)=O
: