Target
Replicase polyprotein 1ab
Ligand
BDBM50458466
Substrate
Meas. Tech.
ChEMBL_1763458 (CHEMBL4198705)
IC50
900±n/a nM
Citation
 Galasiti Kankanamalage, ACKim, YDamalanka, VCRathnayake, ADFehr, ARMehzabeen, NBattaile, KPLovell, SLushington, GHPerlman, SChang, KOGroutas, WC Structure-guided design of potent and permeable inhibitors of MERS coronavirus 3CL protease that utilize a piperidine moiety as a novel design element. Eur J Med Chem 150:334-346 (2018)  
Target
Name:
Replicase polyprotein 1ab
Synonyms:
2.1.1.- 3.1.-.- 3.4.19.12 3.4.22.69 3.6.4.13 3CL-PRO ExoN Growth factor-like peptide Hel Host translation inhibitor nsp1 NendoU Non-structural protein 2 Non-structural protein 4 Non-structural protein 7 Non-structural protein 9 PL-PRO Pol RNA-directed RNA polymerase Replicase polyprotein 1ab nsp1 nsp12 nsp14 nsp16 nsp3 nsp5 nsp7 nsp9 pp1ab | rep
Type:
PROTEIN
Mol. Mass.:
789589.93
Organism:
Middle East respiratory syndrome-related coronavirus (isolate UnitedKingdom/H123990006/2012) (Betacoronavirus England 1) (Humancoronavirus EMC)
Description:
ChEMBL_117802
Residue:
7078
  
Inhibitor
Name:
BDBM50458466
Synonyms:
CHEMBL4208764
Type:
Small organic molecule
Emp. Form.:
C27H41N4NaO10S2
Mol. Mass.:
668.755
SMILES:
[Na;v0+].[#6]-[#6](-[#6])-[#6]-[#6@H](-[#7]-[#6](=O)-[#8]C1([#6]-c2ccccc2)[#6]-[#6]-[#7](-[#6]-[#6]1)S([#6])(=O)=O)-[#6](=O)-[#7]-[#6@@H](-[#6]-[#6@@H]-1-[#6]-[#6]-[#7]-[#6]-1=O)-[#6](-[#8])S([#8-])(=O)=O
: