Target
Macrophage migration inhibitory factor
Ligand
BDBM50240520
Substrate
Meas. Tech.
ChEMBL_1764064 (CHEMBL4199311)
IC50
790±n/a nM
Citation
 Trivedi-Parmar, VJorgensen, WL Advances and Insights for Small Molecule Inhibition of Macrophage Migration Inhibitory Factor. J Med Chem 61:8104-8119 (2018)  
Target
Name:
Macrophage migration inhibitory factor
Synonyms:
GIF Glycosylation-inhibiting factor L-dopachrome tautomerase MIF/CD74 (Macrophage migration inhibitory factor and HLA-DR antigens-associated invariant chain) MMIF Macrophage migration inhibitory factor (MIF) | Phenylpyruvate tautomerase
Type:
Enzyme
Mol. Mass.:
12478.18
Organism:
Homo sapiens (Human)
Description:
P14174
Residue:
115
  
Inhibitor
Name:
BDBM50240520
Synonyms:
(isothiocyanatomethyl)benzene Benzylsenfoel Isothiocyanic acid, benzyl ester benzyl isothiocyanate
Type:
Small organic molecule
Emp. Form.:
C8H7NS
Mol. Mass.:
149.213
SMILES:
S=C=NCc1ccccc1
: