Target
5-hydroxytryptamine receptor 7
Ligand
BDBM50098551
Substrate
Meas. Tech.
ChEMBL_1764145 (CHEMBL4199392)
IC50
0.933254±n/a nM
Citation
 Kim, YKim, HLee, JLee, JKMin, SJSeong, JRhim, HTae, JLee, HJChoo, H Discovery of ?-Arrestin Biased Ligands of 5-HT J Med Chem 61:7218-7233 (2018)  
Target
Name:
5-hydroxytryptamine receptor 7
Synonyms:
5-HT-7 5-HT7 5-HT7S 5HT7 HTR7 | Serotonin receptor 7
Type:
G Protein-Coupled Receptor (GPCR)
Mol. Mass.:
53573.08
Organism:
Homo sapiens (Human)
Description:
P34969
Residue:
479
  
Inhibitor
Name:
BDBM50098551
Synonyms:
(R)-3-(2-(2-(4-methylpiperidin-1-yl)ethyl)pyrrolidin-1-ylsulfonyl)phenol 3-{(R)-2-[2-(4-Methyl-piperidin-1-yl)-ethyl]-pyrrolidine-1-sulfonyl}-phenol 3-{2-[2-(4-Methyl-piperidin-1-yl)-ethyl]-pyrrolidine-1-sulfonyl}-phenol CHEMBL282199 | SB-269970
Type:
Small organic molecule
Emp. Form.:
C18H28N2O3S
Mol. Mass.:
352.492
SMILES:
CC1CCN(CC[C@H]2CCCN2S(=O)(=O)c2cccc(O)c2)CC1
: