Target
Uracil nucleotide/cysteinyl leukotriene receptor
Ligand
BDBM50033437
Substrate
Meas. Tech.
ChEMBL_1764841 (CHEMBL4200088)
IC50
>30000±n/a nM
Citation
 Baqi, YPillaiyar, TAbdelrahman, AKaufmann, OAlshaibani, SRafehi, MGhasimi, SAkkari, RRitter, KSimon, KSpinrath, AKostenis, EZhao, QKöse, MNamasivayam, VMüller, CE 3-(2-Carboxyethyl)indole-2-carboxylic Acid Derivatives: Structural Requirements and Properties of Potent Agonists of the Orphan G Protein-Coupled Receptor GPR17. J Med Chem 61:8136-8154 (2018)  
Target
Name:
Uracil nucleotide/cysteinyl leukotriene receptor
Synonyms:
GPR17 | GPR17_HUMAN
Type:
PROTEIN
Mol. Mass.:
41013.71
Organism:
Homo sapiens (Human)
Description:
ChEMBL_1353471
Residue:
367
  
Inhibitor
Name:
BDBM50033437
Synonyms:
CHEMBL905 N,N-dimethyl-2-[5-(1,2,4-triazol-1-ylmethyl)-1H-indol-3-yl]-ethanamine N,N-dimethyl-5-(1H-1,2,4-triazol-1-ylmethyl)-1H-indole-3-ethanamine risatriptan
Type:
Small organic molecule
Emp. Form.:
C15H19N5
Mol. Mass.:
269.3449
SMILES:
CN(C)CCc1c[nH]c2ccc(Cn3cncn3)cc12
: