Target
Aldehyde dehydrogenase family 1 member A3
Ligand
BDBM50459612
Substrate
Meas. Tech.
ChEMBL_1766763 (CHEMBL4202010)
IC50
170±n/a nM
Citation
 Huddle, BCGrimley, EBuchman, CDChtcherbinine, MDebnath, BMehta, PYang, KMorgan, CALi, SFelton, JSun, DMehta, GNeamati, NBuckanovich, RJHurley, TDLarsen, SD Structure-Based Optimization of a Novel Class of Aldehyde Dehydrogenase 1A (ALDH1A) Subfamily-Selective Inhibitors as Potential Adjuncts to Ovarian Cancer Chemotherapy. J Med Chem 61:8754-8773 (2018)  
Target
Name:
Aldehyde dehydrogenase family 1 member A3
Synonyms:
AL1A3_HUMAN ALDH6 Aldehyde dehydrogenase family 1 member A3 RalDH3 | Retinaldehyde dehydrogenase 3
Type:
PROTEIN
Mol. Mass.:
56110.85
Organism:
Homo sapiens (Human)
Description:
ChEMBL_109700
Residue:
512
  
Inhibitor
Name:
BDBM50459612
Synonyms:
CHEMBL4205216
Type:
Small organic molecule
Emp. Form.:
C22H19FN4OS
Mol. Mass.:
406.476
SMILES:
Fc1cccc(CSc2nc3nn(CC4CC4)cc3c(=O)n2-c2ccccc2)c1
: