Target
Sodium-dependent serotonin transporter
Ligand
BDBM86748
Substrate
Meas. Tech.
ChEMBL_1767585 (CHEMBL4219697)
IC50
53±n/a nM
Citation
 Subbaiah, MAM Triple Reuptake Inhibitors as Potential Therapeutics for Depression and Other Disorders: Design Paradigm and Developmental Challenges. J Med Chem 61:2133-2165 (2018)  
Target
Name:
Sodium-dependent serotonin transporter
Synonyms:
5-HT Transporter 5HTT SC6A4_HUMAN SLC6A4 Serotonin transporter (5HTT) Sodium-dependent serotonin transporter (SERT) | Solute carrier family 6 member 4
Type:
Multi-pass membrane protein
Mol. Mass.:
70322.51
Organism:
Homo sapiens (Human)
Description:
P31645
Residue:
630
  
Inhibitor
Name:
BDBM86748
Synonyms:
CAS_386750-22-7 NSC_6918664 US9944618, Compound ID No. 181
Type:
Small organic molecule
Emp. Form.:
C16H25NO2
Mol. Mass.:
263.3752
SMILES:
CN(C)CC(c1ccc(O)cc1)C1(O)CCCCC1
: