Target
Cholinesterase
Ligand
BDBM31773
Substrate
Meas. Tech.
ChEMBL_1769093 (CHEMBL4221205)
IC50
17400±n/a nM
Citation
 Lu, XHe, SYLi, QYang, HJiang, XLin, HChen, YQu, WFeng, FBian, YZhou, YSun, H Investigation of multi-target-directed ligands (MTDLs) with butyrylcholinesterase (BuChE) and indoleamine 2,3-dioxygenase 1 (IDO1) inhibition: The design, synthesis of miconazole analogues targeting Alzheimer's disease. Bioorg Med Chem 26:1665-1674 (2018)  
Target
Name:
Cholinesterase
Synonyms:
BCHE CHLE_HORSE | Cholinesterase
Type:
Enzyme
Mol. Mass.:
65643.35
Organism:
Equus caballus (Horse)
Description:
P81908
Residue:
574
  
Inhibitor
Name:
BDBM31773
Synonyms:
ECONAZOLE Gyno-pevaryl cid_68589
Type:
Small organic molecule
Emp. Form.:
C18H15Cl3N2O
Mol. Mass.:
381.684
SMILES:
Clc1ccc(COC(Cn2ccnc2)c2ccc(Cl)cc2Cl)cc1
: